{"text_format":"3","workbook":"xlsx","n_sheets":7,"sheets":["Systeem","SjabloonVoorblad","SjabloonWerkproces","KerntakenEnWerkprocessen","Beheersingsniveaus","Voorblad","P6-K1-W3"],"not_rendered":{"macros":1,"defined_names":16,"comments":3},"read":"whole","date_system":"1900"}

{"sheet":"Systeem","index":0,"n_rows":21,"n_cols":3,"rows_kept":21,"hidden":true}
[]
[null,"Ja/Nee"]
[null,"Ja"]
[null,"Nee"]
[]
[null,"Debug modus"]
[null,0,"Normale bedrijfsstand =  0"]
[]
[null,"Teksten"]
[null,"Werkproces motivatie:","Doe dit volgens richtlijnen van de school. Het is raadzaam om in elk geval een onvoldoende te motiveren.\nBij de motivering kan gebruik gemaakt worden van de beschrijvingen in de beoordelingstabel.\n"]
[]
[null,"Fout markeer opmaak:"]
[]
[]
[null,"\"Grey-out\" opmaak:","greyed out"]
[]
[null,"Copyright tekst:","© Stichting Praktijkleren"]
[]
[null,"Regel afbreken werkprocesnaam:",45]
[]
[null,"Systeem versie:","30g"]

{"sheet":"SjabloonVoorblad","index":1,"n_rows":14,"n_cols":3,"rows_kept":14,"hidden":true,"merged":[[0,0,0,2],[2,0,2,2],[5,1,5,2],[6,1,6,2],[7,1,7,2],[8,1,8,2],[9,1,9,2],[11,1,11,2],[13,1,13,2]]}
["Beoordelingsformulier praktijkexamen"]
[]
["Algemene informatie"]
[]
["Code beoordelingsformulier en vaststellingsdatum","BF_MCS_BS22-PE22_P6-K1-W3_1",{"$f":"KerntakenEnWerkprocessen!B3","v":"2022-06-21"}]
["Examenvorm","[Examenvorm]"]
["Examennaam","[Examennaam]"]
["Examencode","[Examencode]"]
["Profiel","P6: Marketing & Communication Specialist, niveau 4"]
["Kwalificatiedossier","Business Services"]
["Cohort en crebocode","2022 en verder",25727]
["Kerntaak","Verzorgt marketing en (interne) communicatietrajecten"]
[]
["Werkprocessen","P6-K1-W3 Voert marktonderzoeken uit"]

{"sheet":"SjabloonWerkproces","index":2,"n_rows":19,"n_cols":4,"rows_kept":19,"hidden":true,"merged":[[9,1,9,6],[10,1,10,6],[12,1,12,6]]}
["Werkproces:",null,{"$f":"VLOOKUP(B1,werkprocessen,2,FALSE)","v":{"$error":"#N/A"}}]
["Eerste opdracht:",{"$f":"VLOOKUP(B1,KerntakenEnWerkprocessen!B13:E27,3,FALSE)","v":{"$error":"#N/A"}}]
["Laatste opdracht:",{"$f":"VLOOKUP(B1,KerntakenEnWerkprocessen!B13:E27,4,FALSE)","v":{"$error":"#N/A"}}]
["PuntentotaalMax",{"$f":"SUM(N:N)","v":0},"Invullen gestart:",{"$f":"IF(SUM(O:O)>0,TRUE,FALSE)","v":false}]
["PuntentotaalBehaald",{"$f":"SUM(M:M)","v":0}]
["#Ant. Mog. <=1",{"$f":"COUNTIF(N:N,1)","v":0}]
["#Ant. Mog. 2-3",{"$f":"COUNTIF(N:N,2)+COUNTIF(N:N,3)","v":0}]
["Cesuur",{"$f":"0.5*B4","v":0}]
[]
[null,"P6-K1-W3: Voert marktonderzoeken uit"]
[null,{"$f":"CONCATENATE(VLOOKUP(B1,werkprocessen,1,FALSE),\": \",C1)","v":{"$error":"#N/A"}}]
[]
[null,"Persoonsinformatie"]
[null,"Datum"]
[null,"Student"]
[null,"Studentnummer"]
[null,"Klas"]
[null,"Beoordelaar 1"]
[null,"Beoordelaar 2"]

{"sheet":"KerntakenEnWerkprocessen","index":3,"n_rows":29,"n_cols":6,"rows_kept":29,"hidden":true,"merged":[[3,1,3,2]]}
["Kerntaken en werkprocessen"]
[{"$nulls":5},{"$f":"F27","v":"P6-K1-W3 Voert marktonderzoeken uit\n \n \n \n \n \n \n \n \n \n \n \n \n \n \n"}]
["Vaststellingsdatum","2022-06-21"]
["Code beoordelingsformulier","BF_BS22_P6-K1-W3_1"]
["Kerntaak",null,"Verzorgt marketing en (interne) communicatietrajecten"]
["Examenvorm",null,"[Examenvorm]"]
["Examennaam en Examencode","[Examennaam]","BS22_P6-K1-W3_1"]
["Kwalificatiedossier en Cohort","Business Services ","2022 en verder"]
["Profiel en crebocode","P6: Marketing & Communication Specialist, niveau 4",25727]
[]
[]
["Werkprocessen","Code","Naam","EersteOpdracht","LaatsteOpdracht","TekstSamengevoegd"]
[null,"P6-K1-W3","Voert marktonderzoeken uit",{"$f":"MIN(IF(Beheersingsniveaus!$A$4:$A$154=KerntakenEnWerkprocessen!$B13,Beheersingsniveaus!$B$4:$B$154))","v":1},{"$f":"MAX(IF(Beheersingsniveaus!$A$4:$A$154=KerntakenEnWerkprocessen!$B13,Beheersingsniveaus!$B$4:$B$154))","v":2},{"$f":"B13&\" \"&C13&CHAR(10)","v":"P6-K1-W3 Voert marktonderzoeken uit\n"}]
[{"$nulls":3},{"$f":"MIN(IF(Beheersingsniveaus!$A$4:$A$154=KerntakenEnWerkprocessen!$B14,Beheersingsniveaus!$B$4:$B$154))","v":0},{"$f":"MAX(IF(Beheersingsniveaus!$A$4:$A$154=KerntakenEnWerkprocessen!$B14,Beheersingsniveaus!$B$4:$B$154))","v":0},{"$f":"F13&B14&\" \"&C14&CHAR(10)","v":"P6-K1-W3 Voert marktonderzoeken uit\n \n"}]
[{"$nulls":3},{"$f":"MIN(IF(Beheersingsniveaus!$A$4:$A$154=KerntakenEnWerkprocessen!$B15,Beheersingsniveaus!$B$4:$B$154))","v":0},{"$f":"MAX(IF(Beheersingsniveaus!$A$4:$A$154=KerntakenEnWerkprocessen!$B15,Beheersingsniveaus!$B$4:$B$154))","v":0},{"$f":"F14&B15&\" \"&C15&CHAR(10)","v":"P6-K1-W3 Voert marktonderzoeken uit\n \n \n"}]
[{"$nulls":3},{"$f":"MIN(IF(Beheersingsniveaus!$A$4:$A$154=KerntakenEnWerkprocessen!$B16,Beheersingsniveaus!$B$4:$B$154))","v":0},{"$f":"MAX(IF(Beheersingsniveaus!$A$4:$A$154=KerntakenEnWerkprocessen!$B16,Beheersingsniveaus!$B$4:$B$154))","v":0},"P6-K1-W3 Voert marktonderzoeken uit\n \n \n \n"]
[{"$nulls":3},{"$f":"MIN(IF(Beheersingsniveaus!$A$4:$A$154=KerntakenEnWerkprocessen!$B17,Beheersingsniveaus!$B$4:$B$154))","v":0},{"$f":"MAX(IF(Beheersingsniveaus!$A$4:$A$154=KerntakenEnWerkprocessen!$B17,Beheersingsniveaus!$B$4:$B$154))","v":0},"P6-K1-W3 Voert marktonderzoeken uit\n \n \n \n \n"]
[{"$nulls":3},{"$f":"MIN(IF(Beheersingsniveaus!$A$4:$A$154=KerntakenEnWerkprocessen!$B18,Beheersingsniveaus!$B$4:$B$154))","v":0},{"$f":"MAX(IF(Beheersingsniveaus!$A$4:$A$154=KerntakenEnWerkprocessen!$B18,Beheersingsniveaus!$B$4:$B$154))","v":0},"P6-K1-W3 Voert marktonderzoeken uit\n \n \n \n \n \n"]
[{"$nulls":3},{"$f":"MIN(IF(Beheersingsniveaus!$A$4:$A$154=KerntakenEnWerkprocessen!$B19,Beheersingsniveaus!$B$4:$B$154))","v":0},{"$f":"MAX(IF(Beheersingsniveaus!$A$4:$A$154=KerntakenEnWerkprocessen!$B19,Beheersingsniveaus!$B$4:$B$154))","v":0},"P6-K1-W3 Voert marktonderzoeken uit\n \n \n \n \n \n \n"]
[{"$nulls":3},{"$f":"MIN(IF(Beheersingsniveaus!$A$4:$A$154=KerntakenEnWerkprocessen!$B20,Beheersingsniveaus!$B$4:$B$154))","v":0},{"$f":"MAX(IF(Beheersingsniveaus!$A$4:$A$154=KerntakenEnWerkprocessen!$B20,Beheersingsniveaus!$B$4:$B$154))","v":0},"P6-K1-W3 Voert marktonderzoeken uit\n \n \n \n \n \n \n \n"]
[{"$nulls":3},{"$f":"MIN(IF(Beheersingsniveaus!$A$4:$A$154=KerntakenEnWerkprocessen!$B21,Beheersingsniveaus!$B$4:$B$154))","v":0},{"$f":"MAX(IF(Beheersingsniveaus!$A$4:$A$154=KerntakenEnWerkprocessen!$B21,Beheersingsniveaus!$B$4:$B$154))","v":0},"P6-K1-W3 Voert marktonderzoeken uit\n \n \n \n \n \n \n \n \n"]
[{"$nulls":3},{"$f":"MIN(IF(Beheersingsniveaus!$A$4:$A$154=KerntakenEnWerkprocessen!$B22,Beheersingsniveaus!$B$4:$B$154))","v":0},{"$f":"MAX(IF(Beheersingsniveaus!$A$4:$A$154=KerntakenEnWerkprocessen!$B22,Beheersingsniveaus!$B$4:$B$154))","v":0},"P6-K1-W3 Voert marktonderzoeken uit\n \n \n \n \n \n \n \n \n \n"]
[{"$nulls":3},{"$f":"MIN(IF(Beheersingsniveaus!$A$4:$A$154=KerntakenEnWerkprocessen!$B23,Beheersingsniveaus!$B$4:$B$154))","v":0},{"$f":"MAX(IF(Beheersingsniveaus!$A$4:$A$154=KerntakenEnWerkprocessen!$B23,Beheersingsniveaus!$B$4:$B$154))","v":0},{"$f":"F22&B23&\" \"&C23&CHAR(10)","v":"P6-K1-W3 Voert marktonderzoeken uit\n \n \n \n \n \n \n \n \n \n \n"}]
[{"$nulls":3},{"$f":"MIN(IF(Beheersingsniveaus!$A$4:$A$154=KerntakenEnWerkprocessen!$B24,Beheersingsniveaus!$B$4:$B$154))","v":0},{"$f":"MAX(IF(Beheersingsniveaus!$A$4:$A$154=KerntakenEnWerkprocessen!$B24,Beheersingsniveaus!$B$4:$B$154))","v":0},"P6-K1-W3 Voert marktonderzoeken uit\n \n \n \n \n \n \n \n \n \n \n \n"]
[{"$nulls":3},{"$f":"MIN(IF(Beheersingsniveaus!$A$4:$A$154=KerntakenEnWerkprocessen!$B25,Beheersingsniveaus!$B$4:$B$154))","v":0},{"$f":"MAX(IF(Beheersingsniveaus!$A$4:$A$154=KerntakenEnWerkprocessen!$B25,Beheersingsniveaus!$B$4:$B$154))","v":0},"P6-K1-W3 Voert marktonderzoeken uit\n \n \n \n \n \n \n \n \n \n \n \n \n"]
[{"$nulls":3},{"$f":"MIN(IF(Beheersingsniveaus!$A$4:$A$154=KerntakenEnWerkprocessen!$B26,Beheersingsniveaus!$B$4:$B$154))","v":0},{"$f":"MAX(IF(Beheersingsniveaus!$A$4:$A$154=KerntakenEnWerkprocessen!$B26,Beheersingsniveaus!$B$4:$B$154))","v":0},"P6-K1-W3 Voert marktonderzoeken uit\n \n \n \n \n \n \n \n \n \n \n \n \n \n"]
[{"$nulls":3},{"$f":"MIN(IF(Beheersingsniveaus!$A$4:$A$154=KerntakenEnWerkprocessen!$B27,Beheersingsniveaus!$B$4:$B$154))","v":0},{"$f":"MAX(IF(Beheersingsniveaus!$A$4:$A$154=KerntakenEnWerkprocessen!$B27,Beheersingsniveaus!$B$4:$B$154))","v":0},"P6-K1-W3 Voert marktonderzoeken uit\n \n \n \n \n \n \n \n \n \n \n \n \n \n \n"]
[]
["Handtekening kandidaat tonen:",null,null,false]

{"sheet":"Beheersingsniveaus","index":4,"n_rows":154,"n_cols":11,"rows_kept":154,"hidden":true}
["Beschrijvingen beheersingsniveaus"]
[]
["Werkproces","Opdracht","OpdrachtId","CriteriumId","Taken","Criterium","Beheersingsniveau 0","Beheersingsniveau 1","Beheersingsniveau 2","Beheersingsniveau 3","Cruciaal"]
["P6-K1-W3",1,{"$f":"IF(A4<>\"\",CONCATENATE(A4,\"-\",B4),\"\")","v":"P6-K1-W3-1"},{"$f":"IF(C4<>\"\",CONCATENATE(C4,\"-\",\"1\"),\"\")","v":"P6-K1-W3-1-1"},"T1","Volledigheid inhoud onderzoeks-\nvoorstel","De informatie in het onderzoeksvoorstel sluit niet aan op de onderzoeksvraag.","De informatie in het onderzoeksvoorstel sluit deels aan op de onderzoeksvraag, maar niet op cruciale punten.","De informatie in het onderzoeksvoorstel sluit deels aan op de onderzoeksvraag, maar wel op cruciale punten.","De informatie in het onderzoeksvoorstel sluit volledig aan op de onderzoeksvraag."]
["P6-K1-W3",1,{"$f":"IF(A5<>\"\",CONCATENATE(A5,\"-\",B5),\"\")","v":"P6-K1-W3-1"},{"$f":"IF(C5<>\"\",CONCATENATE(C5,\"-\",COUNTIF($C$4:C5,C5),\"\"),\"\")","v":"P6-K1-W3-1-2"},"T1","Haalbaarheid onderzoeks-\nvoorstel","Het onderzoeksvoorstel is onhaalbaar, gelet op het beschikbare budget.","Het onderzoeksvoorstel is haalbaar, gelet op het beschikbare budget."]
["P6-K1-W3",1,"P6-K1-W3-1",{"$f":"IF(C6<>\"\",CONCATENATE(C6,\"-\",COUNTIF($C$4:C6,C6),\"\"),\"\")","v":"P6-K1-W3-1-3"},"T2","Relevantie onderzoeksvragen","De uitgewerkte onderzoeksvragen zijn niet relevant.","De uitgewerkte onderzoeksvragen zijn in beperkte mate relevant.","De uitgewerkte onderzoeksvragen zijn grotendeels relevant.","Alle uitgewerkte onderzoeksvragen zijn volledig relevant."]
["P6-K1-W3",2,"P6-K1-W3-2",{"$f":"IF(C7<>\"\",CONCATENATE(C7,\"-\",COUNTIF($C$4:C7,C7),\"\"),\"\")","v":"P6-K1-W3-2-1"},"T3","Kwaliteit gebruikte bronnen","De gebruikte bronnen zijn niet:\n\n- actueel\n- betrouwbaar\n- relevant/passend","De gebruikte bronnen zijn in beperkte mate:\n\n Zie beheersingslijst 0.","De gebruikte bronnen zijn grotendeels:\n\n Zie beheersingslijst 0.","De gebruikte  bronnen zijn volledig:\n\nZie beheersingslijst 0."]
["P6-K1-W3",2,"P6-K1-W3-2",{"$f":"IF(C8<>\"\",CONCATENATE(C8,\"-\",COUNTIF($C$4:C8,C8),\"\"),\"\")","v":"P6-K1-W3-2-2"},"T4","Relevantie conclusies en aanbevelingen","Conclusies en aanbevelingen sluiten niet aan bij de probleemstelling en deelvragen.","Conclusies en aanbevelingen sluiten deels aan bij de probleemstelling en deelvragen, maar niet op cruciale punten.","Conclusies en aanbevelingen sluiten deels aan bij de probleemstelling en deelvragen, maar wel op cruciale punten.","Conclusies en aanbevelingen sluiten volledig aan bij de probleemstelling en deelvragen."]
["P6-K1-W3",2,"P6-K1-W3-2",{"$f":"IF(C9<>\"\",CONCATENATE(C9,\"-\",COUNTIF($C$4:C9,C9),\"\"),\"\")","v":"P6-K1-W3-2-3"},"T4","Accuratie tabellen en grafieken","De resultaten zijn grafisch niet:\n\n- duidelijk\n- overzichtelijk\n  weergegeven","De resultaten zijn grafisch grotendeels:\n\nZie beheersingslijst 0.","De resultaten zijn grafisch, op enkele details na:\n\nZie beheersingslijst 0.","Alle resultaten zijn grafisch:\n\nZie beheersingslijst 0."]
["P6-K1-W3",2,"P6-K1-W3-2",{"$f":"IF(C10<>\"\",CONCATENATE(C10,\"-\",COUNTIF($C$4:C10,C10),\"\"),\"\")","v":"P6-K1-W3-2-4"},"T5","Volledigheid onderzoeks-\nrapport","De informatie in het onderzoeksrapport is onvolledig.","De informatie in het onderzoeksrapport is op meerdere punten onvolledig.","De informatie in het onderzoeksrapport is op enkele details na volledig.","De informatie in het onderzoeksrapport is volledig."]
["P6-K1-W3",2,"P6-K1-W3-2",{"$f":"IF(C11<>\"\",CONCATENATE(C11,\"-\",COUNTIF($C$4:C11,C11),\"\"),\"\")","v":"P6-K1-W3-2-5"},"T5","Taalkundige correctheid","De rapportage is niet correct:\n\n- qua zinsbouw\n- spelling\n- grammatica","De rapportage is in beperkte mate correct:\n\nZie beheersingslijst 0.\n\n ","De rapportage is grotendeels correct:\n\nZie beheersingslijst 0.\n\n","De rapportage is volledig correct:\n\nZie beheersingslijst 0.\n\n"]
["P6-K1-W3",2,"P6-K1-W3-2",{"$f":"IF(C12<>\"\",CONCATENATE(C12,\"-\",COUNTIF($C$4:C12,C12),\"\"),\"\")","v":"P6-K1-W3-2-6"},"T5","Structuur onderzoeks-\nrapport","De informatie is niet gestructureerd (huisstijl en procedures) volgens het model van de organisatie of het format.","De informatie is op meerdere punten niet gestructureerd (huisstijl en procedures) volgens het model van de organisatie of het format.","De informatie is op enkele details na gestructureerd (huisstijl en procedures) volgens het model van de organisatie of het format.","De informatie is volledig gestructureerd (huisstijl en procedures) volgens het model van de organisatie of het format."]
["P6-K1-W3",2,"P6-K1-W3-2",{"$f":"IF(C13<>\"\",CONCATENATE(C13,\"-\",COUNTIF($C$4:C13,C13),\"\"),\"\")","v":"P6-K1-W3-2-7"},"T6","Duidelijkheid presentatie","Het rapport is niet kernachtig en niet duidelijk gepresenteerd.","Het rapport is enigszins kernachtig en niet duidelijk gepresenteerd.","Het rapport is grotendeels kernachtig en duidelijk gepresenteerd.","Het rapport is volledig kernachtig en duidelijk gepresenteerd."]
[null,null,"",{"$f":"IF(C14<>\"\",CONCATENATE(C14,\"-\",COUNTIF($C$4:C14,C14),\"\"),\"\")","v":""}]
[null,null,"",{"$f":"IF(C15<>\"\",CONCATENATE(C15,\"-\",COUNTIF($C$4:C15,C15),\"\"),\"\")","v":""}]
[null,null,"",{"$f":"IF(C16<>\"\",CONCATENATE(C16,\"-\",COUNTIF($C$4:C16,C16),\"\"),\"\")","v":""}]
[null,null,"",{"$f":"IF(C17<>\"\",CONCATENATE(C17,\"-\",COUNTIF($C$4:C17,C17),\"\"),\"\")","v":""}]
[null,null,"",{"$f":"IF(C18<>\"\",CONCATENATE(C18,\"-\",COUNTIF($C$4:C18,C18),\"\"),\"\")","v":""}]
[null,null,"",{"$f":"IF(C19<>\"\",CONCATENATE(C19,\"-\",COUNTIF($C$4:C19,C19),\"\"),\"\")","v":""}]
[null,null,"",{"$f":"IF(C20<>\"\",CONCATENATE(C20,\"-\",COUNTIF($C$4:C20,C20),\"\"),\"\")","v":""}]
[null,null,"",{"$f":"IF(C21<>\"\",CONCATENATE(C21,\"-\",COUNTIF($C$4:C21,C21),\"\"),\"\")","v":""}]
[null,null,"",{"$f":"IF(C22<>\"\",CONCATENATE(C22,\"-\",COUNTIF($C$4:C22,C22),\"\"),\"\")","v":""}]
[null,null,"",{"$f":"IF(C23<>\"\",CONCATENATE(C23,\"-\",COUNTIF($C$4:C23,C23),\"\"),\"\")","v":""}]
[null,null,"",{"$f":"IF(C24<>\"\",CONCATENATE(C24,\"-\",COUNTIF($C$4:C24,C24),\"\"),\"\")","v":""}]
[null,null,"",{"$f":"IF(C25<>\"\",CONCATENATE(C25,\"-\",COUNTIF($C$4:C25,C25),\"\"),\"\")","v":""}]
[null,null,"",{"$f":"IF(C26<>\"\",CONCATENATE(C26,\"-\",COUNTIF($C$4:C26,C26),\"\"),\"\")","v":""}]
[null,null,"",{"$f":"IF(C27<>\"\",CONCATENATE(C27,\"-\",COUNTIF($C$4:C27,C27),\"\"),\"\")","v":""}]
[null,null,"",{"$f":"IF(C28<>\"\",CONCATENATE(C28,\"-\",COUNTIF($C$4:C28,C28),\"\"),\"\")","v":""}]
[null,null,"",{"$f":"IF(C29<>\"\",CONCATENATE(C29,\"-\",COUNTIF($C$4:C29,C29),\"\"),\"\")","v":""}]
[null,null,"",{"$f":"IF(C30<>\"\",CONCATENATE(C30,\"-\",COUNTIF($C$4:C30,C30),\"\"),\"\")","v":""}]
{"$rows_left_out":125}
{"sheet":"Voorblad","index":5,"n_rows":27,"n_cols":4,"rows_kept":27,"merged":[[0,0,0,2],[2,0,2,2],[5,1,5,2],[6,1,6,2],[7,1,7,2],[8,1,8,2],[9,1,9,2],[11,1,11,2],[13,1,13,2],[15,0,15,2],[16,1,16,2],[17,1,17,2],[18,1,18,2],[19,1,19,2],[20,1,20,2],[21,1,21,2],[23,2,24,2]]}
["Beoordelingsformulier praktijkexamen"]
[]
["Algemene informatie"]
[]
["Code beoordelingsformulier en vaststellingsdatum","BF_MCS_BS22_P6-K1-W3_1",{"$f":"KerntakenEnWerkprocessen!B3","v":"2022-06-21"}]
["Examenvorm","Praktijkexamen"]
["Examennaam","[Examennaam]"]
["Examencode","MCS_BS22-PE22_P6-K1-W3_1"]
["Profiel","P6: Marketing & Communication Specialist, niveau 4"]
["Kwalificatiedossier","Business Services"]
["Cohort en crebocode","2022 en verder",25727]
["Kerntaak","Verzorgt marketing en (interne) communicatietrajecten"]
[]
["Werkprocessen","P6-K1-W3 Voert marktonderzoeken uit"]
[]
["Persoonsinformatie"]
["Datum",null,null," [Vul alleen de groene cellen in]"]
["Student"]
["Studentnummer"]
["Klas"]
["Beoordelaar 1"]
["Beoordelaar 2"]
[]
["Werkprocessen","Resultaat","[Laat de rode cellen leeg. Excel vult het resultaat automatisch in na beoordeling van de werkprocessen.]"]
["P6-K1-W3",{"$f":"'P6-K1-W3'!B71","v":""}]
[]
["Handtekening beoordelaar 1","Handtekening beoordelaar 2"]

{"sheet":"P6-K1-W3","index":6,"n_rows":80,"n_cols":15,"rows_kept":80,"merged":[[9,1,9,6],[10,1,10,6],[12,1,12,6],[20,1,20,6],[27,1,27,6],[38,1,38,6],[74,1,74,6],[75,1,75,6]]}
["Werkproces:","P6-K1-W3",{"$f":"VLOOKUP(B1,werkprocessen,2,FALSE)","v":"Voert marktonderzoeken uit"}]
["Eerste opdracht:",{"$f":"VLOOKUP(B1,KerntakenEnWerkprocessen!B13:E27,3,FALSE)","v":1}]
["Laatste opdracht:",{"$f":"VLOOKUP(B1,KerntakenEnWerkprocessen!B13:E27,4,FALSE)","v":2}]
["PuntentotaalMax",{"$f":"SUM(N:N)","v":28},"Invullen gestart:",{"$f":"IF(SUM(O:O)>0,TRUE,FALSE)","v":true}]
["PuntentotaalBehaald",{"$f":"SUM(M:M)","v":0}]
["#Ant. Mog. <=1",{"$f":"COUNTIF(N:N,1)","v":1}]
["#Ant. Mog. 2-3",{"$f":"COUNTIF(N:N,2)+COUNTIF(N:N,3)","v":9}]
["Cesuur",{"$f":"0.5*B4","v":14}]
[]
[null,"P6-K1-W3: Voert marktonderzoeken uit"]
[null,{"$f":"CONCATENATE(VLOOKUP(B1,werkprocessen,1,FALSE),\": \",C1)","v":"P6-K1-W3: Voert marktonderzoeken uit"}]
[]
[null,"Persoonsinformatie"]
[null,"Datum",{"$f":"IF(Voorblad!B17=\"\",\"\",Voorblad!B17)","v":""}]
[null,"Student",{"$f":"IF(Voorblad!B18=\"\",\"\",Voorblad!B18)","v":""}]
[null,"Studentnummer",{"$f":"IF(Voorblad!B19=\"\",\"\",Voorblad!B19)","v":""}]
[null,"Klas",{"$f":"IF(Voorblad!B20=\"\",\"\",Voorblad!B20)","v":""}]
[null,"Beoordelaar 1",{"$f":"IF(Voorblad!B21=\"\",\"\",Voorblad!B21)","v":""}]
[null,"Beoordelaar 2",{"$f":"IF(Voorblad!B22=\"\",\"\",Voorblad!B22)","v":""}]
[]
[null,"Beoordeling opdracht 1"]
["Opdracht:",1,null,"OpdrachtId:","P6-K1-W3-1",null,"Aantal criteria:",{"$f":"COUNTIF(Beheersingsniveaus!$C$4:$C$154,$E22)","v":3}]
["CriteriumId","Taak","Criterium",0,1,2,3,"Cruciaal","Cb0","Cb1","Cb2","Cb3","PuntentotaalBehaald","PuntentotaalMax","CheckboxenIngevuld"]
["P6-K1-W3-1-1",{"$f":"VLOOKUP($A24,Beheersingsniveaus!$D$4:$K$154,2,FALSE)","v":"T1"},{"$f":"CONCATENATE(VLOOKUP($A24,Beheersingsniveaus!$D$4:$K$154,3,FALSE),IF($H24=ja,\"*\",\"\"))","v":"Volledigheid inhoud onderzoeks-\nvoorstel"},{"$f":"VLOOKUP($A24,Beheersingsniveaus!$D$4:$K$154,4,FALSE)","v":"De informatie in het onderzoeksvoorstel sluit niet aan op de onderzoeksvraag."},{"$f":"VLOOKUP($A24,Beheersingsniveaus!$D$4:$K$154,5,FALSE)","v":"De informatie in het onderzoeksvoorstel sluit deels aan op de onderzoeksvraag, maar niet op cruciale punten."},{"$f":"VLOOKUP($A24,Beheersingsniveaus!$D$4:$K$154,6,FALSE)","v":"De informatie in het onderzoeksvoorstel sluit deels aan op de onderzoeksvraag, maar wel op cruciale punten."},{"$f":"VLOOKUP($A24,Beheersingsniveaus!$D$4:$K$154,7,FALSE)","v":"De informatie in het onderzoeksvoorstel sluit volledig aan op de onderzoeksvraag."},{"$f":"VLOOKUP($A24,Beheersingsniveaus!$D$4:$K$154,8,FALSE)","v":0},null,null,false,false,{"$f":"IF(L24=TRUE,3,IF(K24=TRUE,2,IF(J24=TRUE,1,IF(I24=TRUE,0,0))))","v":0},{"$f":"(4-COUNTBLANK(D24:G24))-1","v":3},{"$f":"COUNTA(I24:L24)","v":2}]
["P6-K1-W3-1-2",{"$f":"VLOOKUP($A25,Beheersingsniveaus!$D$4:$K$154,2,FALSE)","v":"T1"},{"$f":"CONCATENATE(VLOOKUP($A25,Beheersingsniveaus!$D$4:$K$154,3,FALSE),IF($H25=ja,\"*\",\"\"))","v":"Haalbaarheid onderzoeks-\nvoorstel"},{"$f":"VLOOKUP($A25,Beheersingsniveaus!$D$4:$K$154,4,FALSE)","v":"Het onderzoeksvoorstel is onhaalbaar, gelet op het beschikbare budget."},{"$f":"VLOOKUP($A25,Beheersingsniveaus!$D$4:$K$154,5,FALSE)","v":"Het onderzoeksvoorstel is haalbaar, gelet op het beschikbare budget."},null,null,{"$f":"VLOOKUP($A25,Beheersingsniveaus!$D$4:$K$154,8,FALSE)","v":0},{"$nulls":4},{"$f":"IF(L25=TRUE,3,IF(K25=TRUE,2,IF(J25=TRUE,1,IF(I25=TRUE,0,0))))","v":0},{"$f":"(4-COUNTBLANK(D25:G25))-1","v":1},{"$f":"COUNTA(I25:L25)","v":0}]
["P6-K1-W3-1-3",{"$f":"VLOOKUP($A26,Beheersingsniveaus!$D$4:$K$154,2,FALSE)","v":"T2"},{"$f":"CONCATENATE(VLOOKUP($A26,Beheersingsniveaus!$D$4:$K$154,3,FALSE),IF($H26=ja,\"*\",\"\"))","v":"Relevantie onderzoeksvragen"},{"$f":"VLOOKUP($A26,Beheersingsniveaus!$D$4:$K$154,4,FALSE)","v":"De uitgewerkte onderzoeksvragen zijn niet relevant."},{"$f":"VLOOKUP($A26,Beheersingsniveaus!$D$4:$K$154,5,FALSE)","v":"De uitgewerkte onderzoeksvragen zijn in beperkte mate relevant."},{"$f":"VLOOKUP($A26,Beheersingsniveaus!$D$4:$K$154,6,FALSE)","v":"De uitgewerkte onderzoeksvragen zijn grotendeels relevant."},{"$f":"VLOOKUP($A26,Beheersingsniveaus!$D$4:$K$154,7,FALSE)","v":"Alle uitgewerkte onderzoeksvragen zijn volledig relevant."},{"$f":"VLOOKUP($A26,Beheersingsniveaus!$D$4:$K$154,8,FALSE)","v":0},{"$nulls":3},false,{"$f":"IF(L26=TRUE,3,IF(K26=TRUE,2,IF(J26=TRUE,1,IF(I26=TRUE,0,0))))","v":0},{"$f":"(4-COUNTBLANK(D26:G26))-1","v":3},{"$f":"COUNTA(I26:L26)","v":1}]
[]
[null,"Beoordeling opdracht 2"]
["Opdracht:",2,null,"OpdrachtId:","P6-K1-W3-2",null,"Aantal criteria:",{"$f":"COUNTIF(Beheersingsniveaus!$C$4:$C$154,$E29)","v":7}]
["CriteriumId","Taak","Criterium",0,1,2,3,"Cruciaal","Cb0","Cb1","Cb2","Cb3","PuntentotaalBehaald","PuntentotaalMax","CheckboxenIngevuld"]
{"$rows_left_out":50}